Ticket #93: build.log

File build.log, 25.9 KB (added by Shum, 3 years ago)

build log

Line 
1make  all-recursive
2make[1]: Entering directory `/usr/local/src/libcaca/trunk'
3Making all in kernel
4make[2]: Entering directory `/usr/local/src/libcaca/trunk/kernel'
5make[2]: Nothing to be done for `all'.
6make[2]: Leaving directory `/usr/local/src/libcaca/trunk/kernel'
7Making all in caca
8make[2]: Entering directory `/usr/local/src/libcaca/trunk/caca'
9make[2]: Nothing to be done for `all'.
10make[2]: Leaving directory `/usr/local/src/libcaca/trunk/caca'
11Making all in src
12make[2]: Entering directory `/usr/local/src/libcaca/trunk/src'
13make[2]: Nothing to be done for `all'.
14make[2]: Leaving directory `/usr/local/src/libcaca/trunk/src'
15Making all in examples
16make[2]: Entering directory `/usr/local/src/libcaca/trunk/examples'
17make[2]: Nothing to be done for `all'.
18make[2]: Leaving directory `/usr/local/src/libcaca/trunk/examples'
19Making all in tools
20make[2]: Entering directory `/usr/local/src/libcaca/trunk/tools'
21make[2]: Nothing to be done for `all'.
22make[2]: Leaving directory `/usr/local/src/libcaca/trunk/tools'
23Making all in cxx
24make[2]: Entering directory `/usr/local/src/libcaca/trunk/cxx'
25make[2]: Nothing to be done for `all'.
26make[2]: Leaving directory `/usr/local/src/libcaca/trunk/cxx'
27Making all in caca-sharp
28make[2]: Entering directory `/usr/local/src/libcaca/trunk/caca-sharp'
29make[2]: Nothing to be done for `all'.
30make[2]: Leaving directory `/usr/local/src/libcaca/trunk/caca-sharp'
31Making all in python
32make[2]: Entering directory `/usr/local/src/libcaca/trunk/python'
33make[2]: Nothing to be done for `all'.
34make[2]: Leaving directory `/usr/local/src/libcaca/trunk/python'
35Making all in ruby
36make[2]: Entering directory `/usr/local/src/libcaca/trunk/ruby'
37make[2]: Nothing to be done for `all'.
38make[2]: Leaving directory `/usr/local/src/libcaca/trunk/ruby'
39Making all in java
40make[2]: Entering directory `/usr/local/src/libcaca/trunk/java'
41make  all-am
42make[3]: Entering directory `/usr/local/src/libcaca/trunk/java'
43/bin/sh ../libtool --tag=CC   --mode=compile gcc -DHAVE_CONFIG_H -I. -I..  -I/usr/lib/jvm/java-6-openjdk/bin/../include -I/usr/lib/jvm/java-6-openjdk/bin/../include/linux -DOPTIMISE_SLANG_PALETTE=1   -I/usr/lib/jvm/java-6-openjdk/bin/../include -I/usr/lib/jvm/java-6-openjdk/bin/../include/linux  -g -O2 -g -O2 -fno-strength-reduce -fomit-frame-pointer -Wall -Wpointer-arith -Wcast-align -Wcast-qual -Wstrict-prototypes -Wshadow -Waggregate-return -Wmissing-prototypes -Wnested-externs -Wsign-compare -MT libcaca_java_la-org_zoy_caca_Canvas.lo -MD -MP -MF .deps/libcaca_java_la-org_zoy_caca_Canvas.Tpo -c -o libcaca_java_la-org_zoy_caca_Canvas.lo `test -f 'org_zoy_caca_Canvas.c' || echo './'`org_zoy_caca_Canvas.c
44 gcc -DHAVE_CONFIG_H -I. -I.. -I/usr/lib/jvm/java-6-openjdk/bin/../include -I/usr/lib/jvm/java-6-openjdk/bin/../include/linux -DOPTIMISE_SLANG_PALETTE=1 -I/usr/lib/jvm/java-6-openjdk/bin/../include -I/usr/lib/jvm/java-6-openjdk/bin/../include/linux -g -O2 -g -O2 -fno-strength-reduce -fomit-frame-pointer -Wall -Wpointer-arith -Wcast-align -Wcast-qual -Wstrict-prototypes -Wshadow -Waggregate-return -Wmissing-prototypes -Wnested-externs -Wsign-compare -MT libcaca_java_la-org_zoy_caca_Canvas.lo -MD -MP -MF .deps/libcaca_java_la-org_zoy_caca_Canvas.Tpo -c org_zoy_caca_Canvas.c  -fPIC -DPIC -o .libs/libcaca_java_la-org_zoy_caca_Canvas.o
45org_zoy_caca_Canvas.c: In function ‘Java_org_zoy_caca_Canvas_getCursorX’:
46org_zoy_caca_Canvas.c:20: warning: implicit declaration of function ‘caca_get_cursor_x’
47org_zoy_caca_Canvas.c:20: warning: nested extern declaration of ‘caca_get_cursor_x’
48org_zoy_caca_Canvas.c:20: error: ‘caca_canvas_t’ undeclared (first use in this function)
49org_zoy_caca_Canvas.c:20: error: (Each undeclared identifier is reported only once
50org_zoy_caca_Canvas.c:20: error: for each function it appears in.)
51org_zoy_caca_Canvas.c:20: error: expected expression before ‘)’ token
52org_zoy_caca_Canvas.c: In function ‘Java_org_zoy_caca_Canvas_getCursorY’:
53org_zoy_caca_Canvas.c:26: warning: implicit declaration of function ‘caca_get_cursor_y’
54org_zoy_caca_Canvas.c:26: warning: nested extern declaration of ‘caca_get_cursor_y’
55org_zoy_caca_Canvas.c:26: error: ‘caca_canvas_t’ undeclared (first use in this function)
56org_zoy_caca_Canvas.c:26: error: expected expression before ‘)’ token
57org_zoy_caca_Canvas.c: In function ‘Java_org_zoy_caca_Canvas_setCursorXY’:
58org_zoy_caca_Canvas.c:32: warning: implicit declaration of function ‘caca_gotoxy’
59org_zoy_caca_Canvas.c:32: warning: nested extern declaration of ‘caca_gotoxy’
60org_zoy_caca_Canvas.c:32: error: ‘caca_canvas_t’ undeclared (first use in this function)
61org_zoy_caca_Canvas.c:32: error: expected expression before ‘)’ token
62org_zoy_caca_Canvas.c: In function ‘Java_org_zoy_caca_Canvas_getHandleX’:
63org_zoy_caca_Canvas.c:38: warning: implicit declaration of function ‘caca_get_canvas_handle_x’
64org_zoy_caca_Canvas.c:38: warning: nested extern declaration of ‘caca_get_canvas_handle_x’
65org_zoy_caca_Canvas.c:38: error: ‘caca_canvas_t’ undeclared (first use in this function)
66org_zoy_caca_Canvas.c:38: error: expected expression before ‘)’ token
67org_zoy_caca_Canvas.c: In function ‘Java_org_zoy_caca_Canvas_getHandleY’:
68org_zoy_caca_Canvas.c:44: error: ‘caca_canvas_t’ undeclared (first use in this function)
69org_zoy_caca_Canvas.c:44: error: expected expression before ‘)’ token
70org_zoy_caca_Canvas.c: In function ‘Java_org_zoy_caca_Canvas_setHandleXY’:
71org_zoy_caca_Canvas.c:50: warning: implicit declaration of function ‘caca_set_canvas_handle’
72org_zoy_caca_Canvas.c:50: warning: nested extern declaration of ‘caca_set_canvas_handle’
73org_zoy_caca_Canvas.c:50: error: ‘caca_canvas_t’ undeclared (first use in this function)
74org_zoy_caca_Canvas.c:50: error: expected expression before ‘)’ token
75org_zoy_caca_Canvas.c: In function ‘Java_org_zoy_caca_Canvas_createCanvas’:
76org_zoy_caca_Canvas.c:56: warning: implicit declaration of function ‘caca_create_canvas’
77org_zoy_caca_Canvas.c:56: warning: nested extern declaration of ‘caca_create_canvas’
78org_zoy_caca_Canvas.c: In function ‘Java_org_zoy_caca_Canvas_getCanvasWidth’:
79org_zoy_caca_Canvas.c:62: warning: implicit declaration of function ‘caca_get_canvas_width’
80org_zoy_caca_Canvas.c:62: warning: nested extern declaration of ‘caca_get_canvas_width’
81org_zoy_caca_Canvas.c:62: error: ‘caca_canvas_t’ undeclared (first use in this function)
82org_zoy_caca_Canvas.c:62: error: expected expression before ‘)’ token
83org_zoy_caca_Canvas.c: In function ‘Java_org_zoy_caca_Canvas_getCanvasHeight’:
84org_zoy_caca_Canvas.c:68: warning: implicit declaration of function ‘caca_get_canvas_height’
85org_zoy_caca_Canvas.c:68: warning: nested extern declaration of ‘caca_get_canvas_height’
86org_zoy_caca_Canvas.c:68: error: ‘caca_canvas_t’ undeclared (first use in this function)
87org_zoy_caca_Canvas.c:68: error: expected expression before ‘)’ token
88org_zoy_caca_Canvas.c: In function ‘Java_org_zoy_caca_Canvas_setCanvasSize’:
89org_zoy_caca_Canvas.c:74: warning: implicit declaration of function ‘caca_set_canvas_size’
90org_zoy_caca_Canvas.c:74: warning: nested extern declaration of ‘caca_set_canvas_size’
91org_zoy_caca_Canvas.c:74: error: ‘caca_canvas_t’ undeclared (first use in this function)
92org_zoy_caca_Canvas.c:74: error: expected expression before ‘)’ token
93org_zoy_caca_Canvas.c: In function ‘Java_org_zoy_caca_Canvas_clearCanvas’:
94org_zoy_caca_Canvas.c:80: warning: implicit declaration of function ‘caca_clear_canvas’
95org_zoy_caca_Canvas.c:80: warning: nested extern declaration of ‘caca_clear_canvas’
96org_zoy_caca_Canvas.c:80: error: ‘caca_canvas_t’ undeclared (first use in this function)
97org_zoy_caca_Canvas.c:80: error: expected expression before ‘)’ token
98org_zoy_caca_Canvas.c: In function ‘Java_org_zoy_caca_Canvas_getCanvasChar’:
99org_zoy_caca_Canvas.c:86: warning: implicit declaration of function ‘caca_get_char’
100org_zoy_caca_Canvas.c:86: warning: nested extern declaration of ‘caca_get_char’
101org_zoy_caca_Canvas.c:86: error: ‘caca_canvas_t’ undeclared (first use in this function)
102org_zoy_caca_Canvas.c:86: error: expected expression before ‘)’ token
103org_zoy_caca_Canvas.c: In function ‘Java_org_zoy_caca_Canvas_putCanvasChar’:
104org_zoy_caca_Canvas.c:92: warning: implicit declaration of function ‘caca_put_char’
105org_zoy_caca_Canvas.c:92: warning: nested extern declaration of ‘caca_put_char’
106org_zoy_caca_Canvas.c:92: error: ‘caca_canvas_t’ undeclared (first use in this function)
107org_zoy_caca_Canvas.c:92: error: expected expression before ‘)’ token
108org_zoy_caca_Canvas.c: In function ‘Java_org_zoy_caca_Canvas_putCanvasString’:
109org_zoy_caca_Canvas.c:101: warning: implicit declaration of function ‘caca_put_str’
110org_zoy_caca_Canvas.c:101: warning: nested extern declaration of ‘caca_put_str’
111org_zoy_caca_Canvas.c:101: error: ‘caca_canvas_t’ undeclared (first use in this function)
112org_zoy_caca_Canvas.c:101: error: expected expression before ‘)’ token
113org_zoy_caca_Canvas.c: In function ‘Java_org_zoy_caca_Canvas_blitCanvas’:
114org_zoy_caca_Canvas.c:109: warning: implicit declaration of function ‘caca_blit’
115org_zoy_caca_Canvas.c:109: warning: nested extern declaration of ‘caca_blit’
116org_zoy_caca_Canvas.c:109: error: ‘caca_canvas_t’ undeclared (first use in this function)
117org_zoy_caca_Canvas.c:109: error: expected expression before ‘)’ token
118org_zoy_caca_Canvas.c: In function ‘Java_org_zoy_caca_Canvas_setCanvasBoundaries’:
119org_zoy_caca_Canvas.c:116: warning: implicit declaration of function ‘caca_set_canvas_boundaries’
120org_zoy_caca_Canvas.c:116: warning: nested extern declaration of ‘caca_set_canvas_boundaries’
121org_zoy_caca_Canvas.c:116: error: ‘caca_canvas_t’ undeclared (first use in this function)
122org_zoy_caca_Canvas.c:116: error: expected expression before ‘)’ token
123org_zoy_caca_Canvas.c: In function ‘Java_org_zoy_caca_Canvas_invertCanvas’:
124org_zoy_caca_Canvas.c:122: warning: implicit declaration of function ‘caca_invert’
125org_zoy_caca_Canvas.c:122: warning: nested extern declaration of ‘caca_invert’
126org_zoy_caca_Canvas.c:122: error: ‘caca_canvas_t’ undeclared (first use in this function)
127org_zoy_caca_Canvas.c:122: error: expected expression before ‘)’ token
128org_zoy_caca_Canvas.c: In function ‘Java_org_zoy_caca_Canvas_flipCanvas’:
129org_zoy_caca_Canvas.c:128: warning: implicit declaration of function ‘caca_flip’
130org_zoy_caca_Canvas.c:128: warning: nested extern declaration of ‘caca_flip’
131org_zoy_caca_Canvas.c:128: error: ‘caca_canvas_t’ undeclared (first use in this function)
132org_zoy_caca_Canvas.c:128: error: expected expression before ‘)’ token
133org_zoy_caca_Canvas.c: In function ‘Java_org_zoy_caca_Canvas_flopCanvas’:
134org_zoy_caca_Canvas.c:134: warning: implicit declaration of function ‘caca_flop’
135org_zoy_caca_Canvas.c:134: warning: nested extern declaration of ‘caca_flop’
136org_zoy_caca_Canvas.c:134: error: ‘caca_canvas_t’ undeclared (first use in this function)
137org_zoy_caca_Canvas.c:134: error: expected expression before ‘)’ token
138org_zoy_caca_Canvas.c: In function ‘Java_org_zoy_caca_Canvas_rotateCanvas180’:
139org_zoy_caca_Canvas.c:140: warning: implicit declaration of function ‘caca_rotate_180’
140org_zoy_caca_Canvas.c:140: warning: nested extern declaration of ‘caca_rotate_180’
141org_zoy_caca_Canvas.c:140: error: ‘caca_canvas_t’ undeclared (first use in this function)
142org_zoy_caca_Canvas.c:140: error: expected expression before ‘)’ token
143org_zoy_caca_Canvas.c: In function ‘Java_org_zoy_caca_Canvas_rotateCanvasLeft’:
144org_zoy_caca_Canvas.c:146: warning: implicit declaration of function ‘caca_rotate_left’
145org_zoy_caca_Canvas.c:146: warning: nested extern declaration of ‘caca_rotate_left’
146org_zoy_caca_Canvas.c:146: error: ‘caca_canvas_t’ undeclared (first use in this function)
147org_zoy_caca_Canvas.c:146: error: expected expression before ‘)’ token
148org_zoy_caca_Canvas.c: In function ‘Java_org_zoy_caca_Canvas_rotateCanvasRight’:
149org_zoy_caca_Canvas.c:152: warning: implicit declaration of function ‘caca_rotate_right’
150org_zoy_caca_Canvas.c:152: warning: nested extern declaration of ‘caca_rotate_right’
151org_zoy_caca_Canvas.c:152: error: ‘caca_canvas_t’ undeclared (first use in this function)
152org_zoy_caca_Canvas.c:152: error: expected expression before ‘)’ token
153org_zoy_caca_Canvas.c: In function ‘Java_org_zoy_caca_Canvas_stretchCanvasLeft’:
154org_zoy_caca_Canvas.c:158: warning: implicit declaration of function ‘caca_stretch_left’
155org_zoy_caca_Canvas.c:158: warning: nested extern declaration of ‘caca_stretch_left’
156org_zoy_caca_Canvas.c:158: error: ‘caca_canvas_t’ undeclared (first use in this function)
157org_zoy_caca_Canvas.c:158: error: expected expression before ‘)’ token
158org_zoy_caca_Canvas.c: In function ‘Java_org_zoy_caca_Canvas_stretchCanvasRight’:
159org_zoy_caca_Canvas.c:164: warning: implicit declaration of function ‘caca_stretch_right’
160org_zoy_caca_Canvas.c:164: warning: nested extern declaration of ‘caca_stretch_right’
161org_zoy_caca_Canvas.c:164: error: ‘caca_canvas_t’ undeclared (first use in this function)
162org_zoy_caca_Canvas.c:164: error: expected expression before ‘)’ token
163org_zoy_caca_Canvas.c: In function ‘Java_org_zoy_caca_Canvas_getCanvasAttribute’:
164org_zoy_caca_Canvas.c:170: warning: implicit declaration of function ‘caca_get_attr’
165org_zoy_caca_Canvas.c:170: warning: nested extern declaration of ‘caca_get_attr’
166org_zoy_caca_Canvas.c:170: error: ‘caca_canvas_t’ undeclared (first use in this function)
167org_zoy_caca_Canvas.c:170: error: expected expression before ‘)’ token
168org_zoy_caca_Canvas.c: In function ‘Java_org_zoy_caca_Canvas_setCanvasAttribute’:
169org_zoy_caca_Canvas.c:176: warning: implicit declaration of function ‘caca_set_attr’
170org_zoy_caca_Canvas.c:176: warning: nested extern declaration of ‘caca_set_attr’
171org_zoy_caca_Canvas.c:176: error: ‘caca_canvas_t’ undeclared (first use in this function)
172org_zoy_caca_Canvas.c:176: error: expected expression before ‘)’ token
173org_zoy_caca_Canvas.c: In function ‘Java_org_zoy_caca_Canvas_putCanvasAttribute’:
174org_zoy_caca_Canvas.c:183: warning: implicit declaration of function ‘caca_put_attr’
175org_zoy_caca_Canvas.c:183: warning: nested extern declaration of ‘caca_put_attr’
176org_zoy_caca_Canvas.c:183: error: ‘caca_canvas_t’ undeclared (first use in this function)
177org_zoy_caca_Canvas.c:183: error: expected expression before ‘)’ token
178org_zoy_caca_Canvas.c: In function ‘Java_org_zoy_caca_Canvas_setCanvasColorAnsi’:
179org_zoy_caca_Canvas.c:189: warning: implicit declaration of function ‘caca_set_color_ansi’
180org_zoy_caca_Canvas.c:189: warning: nested extern declaration of ‘caca_set_color_ansi’
181org_zoy_caca_Canvas.c:189: error: ‘caca_canvas_t’ undeclared (first use in this function)
182org_zoy_caca_Canvas.c:189: error: expected expression before ‘)’ token
183org_zoy_caca_Canvas.c: In function ‘Java_org_zoy_caca_Canvas_setCanvasColorArgb’:
184org_zoy_caca_Canvas.c:195: warning: implicit declaration of function ‘caca_set_color_argb’
185org_zoy_caca_Canvas.c:195: warning: nested extern declaration of ‘caca_set_color_argb’
186org_zoy_caca_Canvas.c:195: error: ‘caca_canvas_t’ undeclared (first use in this function)
187org_zoy_caca_Canvas.c:195: error: expected expression before ‘)’ token
188org_zoy_caca_Canvas.c: In function ‘Java_org_zoy_caca_Canvas_canvasDrawLine’:
189org_zoy_caca_Canvas.c:202: warning: implicit declaration of function ‘caca_draw_line’
190org_zoy_caca_Canvas.c:202: warning: nested extern declaration of ‘caca_draw_line’
191org_zoy_caca_Canvas.c:202: error: ‘caca_canvas_t’ undeclared (first use in this function)
192org_zoy_caca_Canvas.c:202: error: expected expression before ‘)’ token
193org_zoy_caca_Canvas.c: In function ‘Java_org_zoy_caca_Canvas_canvasDrawPolyline’:
194org_zoy_caca_Canvas.c:216: warning: implicit declaration of function ‘caca_draw_polyline’
195org_zoy_caca_Canvas.c:216: warning: nested extern declaration of ‘caca_draw_polyline’
196org_zoy_caca_Canvas.c:216: error: ‘caca_canvas_t’ undeclared (first use in this function)
197org_zoy_caca_Canvas.c:216: error: expected expression before ‘)’ token
198org_zoy_caca_Canvas.c: In function ‘Java_org_zoy_caca_Canvas_canvasDrawThinLine’:
199org_zoy_caca_Canvas.c:225: warning: implicit declaration of function ‘caca_draw_thin_line’
200org_zoy_caca_Canvas.c:225: warning: nested extern declaration of ‘caca_draw_thin_line’
201org_zoy_caca_Canvas.c:225: error: ‘caca_canvas_t’ undeclared (first use in this function)
202org_zoy_caca_Canvas.c:225: error: expected expression before ‘)’ token
203org_zoy_caca_Canvas.c: In function ‘Java_org_zoy_caca_Canvas_canvasDrawThinPolyline’:
204org_zoy_caca_Canvas.c:239: warning: implicit declaration of function ‘caca_draw_thin_polyline’
205org_zoy_caca_Canvas.c:239: warning: nested extern declaration of ‘caca_draw_thin_polyline’
206org_zoy_caca_Canvas.c:239: error: ‘caca_canvas_t’ undeclared (first use in this function)
207org_zoy_caca_Canvas.c:239: error: expected expression before ‘)’ token
208org_zoy_caca_Canvas.c: In function ‘Java_org_zoy_caca_Canvas_canvasDrawCircle’:
209org_zoy_caca_Canvas.c:248: warning: implicit declaration of function ‘caca_draw_circle’
210org_zoy_caca_Canvas.c:248: warning: nested extern declaration of ‘caca_draw_circle’
211org_zoy_caca_Canvas.c:248: error: ‘caca_canvas_t’ undeclared (first use in this function)
212org_zoy_caca_Canvas.c:248: error: expected expression before ‘)’ token
213org_zoy_caca_Canvas.c: In function ‘Java_org_zoy_caca_Canvas_canvasDrawEllipse’:
214org_zoy_caca_Canvas.c:255: warning: implicit declaration of function ‘caca_draw_ellipse’
215org_zoy_caca_Canvas.c:255: warning: nested extern declaration of ‘caca_draw_ellipse’
216org_zoy_caca_Canvas.c:255: error: ‘caca_canvas_t’ undeclared (first use in this function)
217org_zoy_caca_Canvas.c:255: error: expected expression before ‘)’ token
218org_zoy_caca_Canvas.c: In function ‘Java_org_zoy_caca_Canvas_canvasDrawThinEllipse’:
219org_zoy_caca_Canvas.c:262: warning: implicit declaration of function ‘caca_draw_thin_ellipse’
220org_zoy_caca_Canvas.c:262: warning: nested extern declaration of ‘caca_draw_thin_ellipse’
221org_zoy_caca_Canvas.c:262: error: ‘caca_canvas_t’ undeclared (first use in this function)
222org_zoy_caca_Canvas.c:262: error: expected expression before ‘)’ token
223org_zoy_caca_Canvas.c: In function ‘Java_org_zoy_caca_Canvas_canvasFillEllipse’:
224org_zoy_caca_Canvas.c:269: warning: implicit declaration of function ‘caca_fill_ellipse’
225org_zoy_caca_Canvas.c:269: warning: nested extern declaration of ‘caca_fill_ellipse’
226org_zoy_caca_Canvas.c:269: error: ‘caca_canvas_t’ undeclared (first use in this function)
227org_zoy_caca_Canvas.c:269: error: expected expression before ‘)’ token
228org_zoy_caca_Canvas.c: In function ‘Java_org_zoy_caca_Canvas_canvasDrawBox’:
229org_zoy_caca_Canvas.c:276: warning: implicit declaration of function ‘caca_draw_box’
230org_zoy_caca_Canvas.c:276: warning: nested extern declaration of ‘caca_draw_box’
231org_zoy_caca_Canvas.c:276: error: ‘caca_canvas_t’ undeclared (first use in this function)
232org_zoy_caca_Canvas.c:276: error: expected expression before ‘)’ token
233org_zoy_caca_Canvas.c: In function ‘Java_org_zoy_caca_Canvas_canvasDrawThinBox’:
234org_zoy_caca_Canvas.c:283: warning: implicit declaration of function ‘caca_draw_thin_box’
235org_zoy_caca_Canvas.c:283: warning: nested extern declaration of ‘caca_draw_thin_box’
236org_zoy_caca_Canvas.c:283: error: ‘caca_canvas_t’ undeclared (first use in this function)
237org_zoy_caca_Canvas.c:283: error: expected expression before ‘)’ token
238org_zoy_caca_Canvas.c: In function ‘Java_org_zoy_caca_Canvas_canvasDrawCp437Box’:
239org_zoy_caca_Canvas.c:290: warning: implicit declaration of function ‘caca_draw_cp437_box’
240org_zoy_caca_Canvas.c:290: warning: nested extern declaration of ‘caca_draw_cp437_box’
241org_zoy_caca_Canvas.c:290: error: ‘caca_canvas_t’ undeclared (first use in this function)
242org_zoy_caca_Canvas.c:290: error: expected expression before ‘)’ token
243org_zoy_caca_Canvas.c: In function ‘Java_org_zoy_caca_Canvas_canvasFillBox’:
244org_zoy_caca_Canvas.c:297: warning: implicit declaration of function ‘caca_fill_box’
245org_zoy_caca_Canvas.c:297: warning: nested extern declaration of ‘caca_fill_box’
246org_zoy_caca_Canvas.c:297: error: ‘caca_canvas_t’ undeclared (first use in this function)
247org_zoy_caca_Canvas.c:297: error: expected expression before ‘)’ token
248org_zoy_caca_Canvas.c: In function ‘Java_org_zoy_caca_Canvas_canvasDrawTriangle’:
249org_zoy_caca_Canvas.c:305: warning: implicit declaration of function ‘caca_draw_triangle’
250org_zoy_caca_Canvas.c:305: warning: nested extern declaration of ‘caca_draw_triangle’
251org_zoy_caca_Canvas.c:305: error: ‘caca_canvas_t’ undeclared (first use in this function)
252org_zoy_caca_Canvas.c:305: error: expected expression before ‘)’ token
253org_zoy_caca_Canvas.c: In function ‘Java_org_zoy_caca_Canvas_canvasDrawThinTriangle’:
254org_zoy_caca_Canvas.c:313: warning: implicit declaration of function ‘caca_draw_thin_triangle’
255org_zoy_caca_Canvas.c:313: warning: nested extern declaration of ‘caca_draw_thin_triangle’
256org_zoy_caca_Canvas.c:313: error: ‘caca_canvas_t’ undeclared (first use in this function)
257org_zoy_caca_Canvas.c:313: error: expected expression before ‘)’ token
258org_zoy_caca_Canvas.c: In function ‘Java_org_zoy_caca_Canvas_canvasFillTriangle’:
259org_zoy_caca_Canvas.c:321: warning: implicit declaration of function ‘caca_fill_triangle’
260org_zoy_caca_Canvas.c:321: warning: nested extern declaration of ‘caca_fill_triangle’
261org_zoy_caca_Canvas.c:321: error: ‘caca_canvas_t’ undeclared (first use in this function)
262org_zoy_caca_Canvas.c:321: error: expected expression before ‘)’ token
263org_zoy_caca_Canvas.c: In function ‘Java_org_zoy_caca_Canvas_getCanvasFrameCount’:
264org_zoy_caca_Canvas.c:327: warning: implicit declaration of function ‘caca_get_frame_count’
265org_zoy_caca_Canvas.c:327: warning: nested extern declaration of ‘caca_get_frame_count’
266org_zoy_caca_Canvas.c:327: error: ‘caca_canvas_t’ undeclared (first use in this function)
267org_zoy_caca_Canvas.c:327: error: expected expression before ‘)’ token
268org_zoy_caca_Canvas.c: In function ‘Java_org_zoy_caca_Canvas_setCanvasFrame’:
269org_zoy_caca_Canvas.c:333: warning: implicit declaration of function ‘caca_set_frame’
270org_zoy_caca_Canvas.c:333: warning: nested extern declaration of ‘caca_set_frame’
271org_zoy_caca_Canvas.c:333: error: ‘caca_canvas_t’ undeclared (first use in this function)
272org_zoy_caca_Canvas.c:333: error: expected expression before ‘)’ token
273org_zoy_caca_Canvas.c: In function ‘Java_org_zoy_caca_Canvas_getCanvasFrameName’:
274org_zoy_caca_Canvas.c:339: warning: implicit declaration of function ‘caca_get_frame_name’
275org_zoy_caca_Canvas.c:339: warning: nested extern declaration of ‘caca_get_frame_name’
276org_zoy_caca_Canvas.c:339: error: ‘caca_canvas_t’ undeclared (first use in this function)
277org_zoy_caca_Canvas.c:339: error: expected expression before ‘)’ token
278org_zoy_caca_Canvas.c:339: warning: initialization makes pointer from integer without a cast
279org_zoy_caca_Canvas.c: In function ‘Java_org_zoy_caca_Canvas_setCanvasFrameName’:
280org_zoy_caca_Canvas.c:347: warning: implicit declaration of function ‘caca_set_frame_name’
281org_zoy_caca_Canvas.c:347: warning: nested extern declaration of ‘caca_set_frame_name’
282org_zoy_caca_Canvas.c:347: error: ‘caca_canvas_t’ undeclared (first use in this function)
283org_zoy_caca_Canvas.c:347: error: expected expression before ‘)’ token
284org_zoy_caca_Canvas.c: In function ‘Java_org_zoy_caca_Canvas_createCanvasFrame’:
285org_zoy_caca_Canvas.c:354: warning: implicit declaration of function ‘caca_create_frame’
286org_zoy_caca_Canvas.c:354: warning: nested extern declaration of ‘caca_create_frame’
287org_zoy_caca_Canvas.c:354: error: ‘caca_canvas_t’ undeclared (first use in this function)
288org_zoy_caca_Canvas.c:354: error: expected expression before ‘)’ token
289org_zoy_caca_Canvas.c: In function ‘Java_org_zoy_caca_Canvas_freeCanvasFrame’:
290org_zoy_caca_Canvas.c:360: warning: implicit declaration of function ‘caca_free_frame’
291org_zoy_caca_Canvas.c:360: warning: nested extern declaration of ‘caca_free_frame’
292org_zoy_caca_Canvas.c:360: error: ‘caca_canvas_t’ undeclared (first use in this function)
293org_zoy_caca_Canvas.c:360: error: expected expression before ‘)’ token
294org_zoy_caca_Canvas.c: In function ‘Java_org_zoy_caca_Canvas_canvasRender’:
295org_zoy_caca_Canvas.c:368: warning: implicit declaration of function ‘caca_render_canvas’
296org_zoy_caca_Canvas.c:368: warning: nested extern declaration of ‘caca_render_canvas’
297org_zoy_caca_Canvas.c:368: error: ‘caca_canvas_t’ undeclared (first use in this function)
298org_zoy_caca_Canvas.c:368: error: expected expression before ‘)’ token
299org_zoy_caca_Canvas.c: In function ‘Java_org_zoy_caca_Canvas_canvasDitherBitmap’:
300org_zoy_caca_Canvas.c:378: warning: implicit declaration of function ‘caca_dither_bitmap’
301org_zoy_caca_Canvas.c:378: warning: nested extern declaration of ‘caca_dither_bitmap’
302org_zoy_caca_Canvas.c:378: error: ‘caca_canvas_t’ undeclared (first use in this function)
303org_zoy_caca_Canvas.c:378: error: expected expression before ‘)’ token
304org_zoy_caca_Canvas.c:377: warning: unused variable ‘size’
305org_zoy_caca_Canvas.c: In function ‘Java_org_zoy_caca_Canvas_freeCanvas’:
306org_zoy_caca_Canvas.c:385: warning: implicit declaration of function ‘caca_free_canvas’
307org_zoy_caca_Canvas.c:385: warning: nested extern declaration of ‘caca_free_canvas’
308org_zoy_caca_Canvas.c:385: error: ‘caca_canvas_t’ undeclared (first use in this function)
309org_zoy_caca_Canvas.c:385: error: expected expression before ‘)’ token
310make[3]: *** [libcaca_java_la-org_zoy_caca_Canvas.lo] Error 1
311make[3]: Leaving directory `/usr/local/src/libcaca/trunk/java'
312make[2]: *** [all] Error 2
313make[2]: Leaving directory `/usr/local/src/libcaca/trunk/java'
314make[1]: *** [all-recursive] Error 1
315make[1]: Leaving directory `/usr/local/src/libcaca/trunk'
316make: *** [all] Error 2